STUDYID,USUBJID,SUBJID,SITEID,AGE,AGEU,SEX,RACE,ETHNIC,COUNTRY,DTHFL,INVID,INVNAM,ARM,ARMCD,ACTARM,ACTARMCD,TRT01P,TRT01A,TRT02P,TRT02A,REGION1,STRATA1,STRATA2,BMRKR1,BMRKR2,ITTFL,SAFFL,BMEASIFL,BEP01FL,AEWITHFL,RANDDT,TRTSDTM,TRTEDTM,TRT01SDTM,TRT01EDTM,TRT02SDTM,TRT02EDTM,AP01SDTM,AP01EDTM,AP02SDTM,AP02EDTM,EOSSTT,EOTSTT,EOSDT,EOSDY,DCSREAS,DTHDT,DTHCAUS,DTHCAT,LDDTHELD,LDDTHGR1,LSTALVDT,DTHADY,ADTHAUT,study_duration_secs,ASEQ,AESEQ,AETERM,AELLT,AEDECOD,AEHLT,AEHLGT,AEBODSYS,AESOC,AESEV,AESER,AEACN,AEREL,AEOUT,AESDTH,AESCONG,AESDISAB,AESHOSP,AESLIFE,AESMIE,TRTEMFL,AECONTRT,ASTDTM,AENDTM,ASTDY,AENDY,LDOSEDTM,AETOXGR,SMQ01NAM,SMQ02NAM,SMQ01SC,SMQ02SC,CQ01NAM,ANL01FL,AERELNST,AEACNOTH
AB12345,AB12345-BRA-1-id-134,id-134,BRA-1,47,YEARS,M,WHITE,NOT HISPANIC OR LATINO,BRA,Y,INV ID BRA-1,Dr. BRA-1 Doe,A: Drug X,ARM A,A: Drug X,ARM A,A: Drug X,A: Drug X,B: Placebo,A: Drug X,South America,B,S2,6.4629905784248,LOW,Y,Y,Y,N,N,2020-11-03,2020-11-04T08:50:33.683Z,2022-02-20T08:01:31.683Z,2020-11-04T08:50:33.683Z,2021-02-20T02:12:19.683Z,2021-02-20T02:12:19.683Z,2022-02-20T08:01:31.683Z,2020-11-04T08:50:33.683Z,2021-02-20T02:12:19.683Z,2021-02-20T02:12:19.683Z,2022-02-20T08:01:31.683Z,DISCONTINUED,DISCONTINUED,2022-02-20,473,DEATH,2022-03-16,ADVERSE EVENT,ADVERSE EVENT,24,<=30,2022-03-16,497,Yes,63113904,1,1,trm B.2.1.2.1,llt B.2.1.2.1,dcd B.2.1.2.1,hlt B.2.1.2,hlgt B.2.1,cl B.2,cl B,MODERATE,N,DOSE NOT CHANGED,N,RECOVERING/RESOLVING,N,N,Y,N,N,N,Y,Y,2021-04-15T00:00:00Z,2021-10-05T00:00:00Z,162,335,2020-11-07T13:36:09.982097Z,3,,,,,,Y,NONE,PROCEDURE/SURGERY
AB12345,AB12345-BRA-1-id-134,id-134,BRA-1,47,YEARS,M,WHITE,NOT HISPANIC OR LATINO,BRA,Y,INV ID BRA-1,Dr. BRA-1 Doe,A: Drug X,ARM A,A: Drug X,ARM A,A: Drug X,A: Drug X,B: Placebo,A: Drug X,South America,B,S2,6.4629905784248,LOW,Y,Y,Y,N,N,2020-11-03,2020-11-04T08:50:33.683Z,2022-02-20T08:01:31.683Z,2020-11-04T08:50:33.683Z,2021-02-20T02:12:19.683Z,2021-02-20T02:12:19.683Z,2022-02-20T08:01:31.683Z,2020-11-04T08:50:33.683Z,2021-02-20T02:12:19.683Z,2021-02-20T02:12:19.683Z,2022-02-20T08:01:31.683Z,DISCONTINUED,DISCONTINUED,2022-02-20,473,DEATH,2022-03-16,ADVERSE EVENT,ADVERSE EVENT,24,<=30,2022-03-16,497,Yes,63113904,2,2,trm D.1.1.4.2,llt D.1.1.4.2,dcd D.1.1.4.2,hlt D.1.1.4,hlgt D.1.1,cl D.1,cl D,MODERATE,N,DOSE NOT CHANGED,N,RECOVERING/RESOLVING,N,N,Y,N,N,N,Y,N,2021-05-20T00:00:00Z,2021-11-01T00:00:00Z,197,362,2021-05-18T03:03:31.504869Z,3,,,,,,Y,CONCURRENT ILLNESS,MEDICATION
AB12345,AB12345-BRA-1-id-134,id-134,BRA-1,47,YEARS,M,WHITE,NOT HISPANIC OR LATINO,BRA,Y,INV ID BRA-1,Dr. BRA-1 Doe,A: Drug X,ARM A,A: Drug X,ARM A,A: Drug X,A: Drug X,B: Placebo,A: Drug X,South America,B,S2,6.4629905784248,LOW,Y,Y,Y,N,N,2020-11-03,2020-11-04T08:50:33.683Z,2022-02-20T08:01:31.683Z,2020-11-04T08:50:33.683Z,2021-02-20T02:12:19.683Z,2021-02-20T02:12:19.683Z,2022-02-20T08:01:31.683Z,2020-11-04T08:50:33.683Z,2021-02-20T02:12:19.683Z,2021-02-20T02:12:19.683Z,2022-02-20T08:01:31.683Z,DISCONTINUED,DISCONTINUED,2022-02-20,473,DEATH,2022-03-16,ADVERSE EVENT,ADVERSE EVENT,24,<=30,2022-03-16,497,Yes,63113904,3,3,trm A.1.1.1.2,llt A.1.1.1.2,dcd A.1.1.1.2,hlt A.1.1.1,hlgt A.1.1,cl A.1,cl A,MODERATE,Y,DOSE NOT CHANGED,N,RECOVERING/RESOLVING,N,N,Y,N,N,N,Y,Y,2021-09-22T00:00:00Z,2022-02-17T00:00:00Z,322,470,2021-05-24T05:24:09.261986Z,2,,,,,,Y,CONCURRENT ILLNESS,SUBJECT DISCONTINUED FROM STUDY
AB12345,AB12345-BRA-1-id-134,id-134,BRA-1,47,YEARS,M,WHITE,NOT HISPANIC OR LATINO,BRA,Y,INV ID BRA-1,Dr. BRA-1 Doe,A: Drug X,ARM A,A: Drug X,ARM A,A: Drug X,A: Drug X,B: Placebo,A: Drug X,South America,B,S2,6.4629905784248,LOW,Y,Y,Y,N,N,2020-11-03,2020-11-04T08:50:33.683Z,2022-02-20T08:01:31.683Z,2020-11-04T08:50:33.683Z,2021-02-20T02:12:19.683Z,2021-02-20T02:12:19.683Z,2022-02-20T08:01:31.683Z,2020-11-04T08:50:33.683Z,2021-02-20T02:12:19.683Z,2021-02-20T02:12:19.683Z,2022-02-20T08:01:31.683Z,DISCONTINUED,DISCONTINUED,2022-02-20,473,DEATH,2022-03-16,ADVERSE EVENT,ADVERSE EVENT,24,<=30,2022-03-16,497,Yes,63113904,4,4,trm A.1.1.1.2,llt A.1.1.1.2,dcd A.1.1.1.2,hlt A.1.1.1,hlgt A.1.1,cl A.1,cl A,MODERATE,Y,DRUG WITHDRAWN,N,RECOVERING/RESOLVING,N,Y,N,N,N,N,Y,N,2021-12-03T00:00:00Z,2022-01-14T00:00:00Z,394,436,2021-03-19T18:46:32.430230Z,2,,,,,,Y,CONCURRENT ILLNESS,SUBJECT DISCONTINUED FROM STUDY
AB12345,AB12345-BRA-1-id-141,id-141,BRA-1,35,YEARS,F,WHITE,NOT HISPANIC OR LATINO,BRA,N,INV ID BRA-1,Dr. BRA-1 Doe,C: Combination,ARM C,C: Combination,ARM C,C: Combination,C: Combination,C: Combination,C: Combination,South America,B,S1,7.51607612428241,HIGH,Y,Y,Y,Y,N,2020-07-22,2020-07-25T19:10:56.683Z,2023-07-26T12:38:32.683Z,2020-07-25T19:10:56.683Z,2022-07-26T06:49:20.683Z,2022-07-26T06:49:20.683Z,2023-07-26T12:38:32.683Z,2020-07-25T19:10:56.683Z,2022-07-26T06:49:20.683Z,2022-07-26T06:49:20.683Z,2023-07-26T12:38:32.683Z,COMPLETED,COMPLETED,2023-07-26,1096,,,,,,,2023-08-08,,,63113904,1,1,trm B.2.1.2.1,llt B.2.1.2.1,dcd B.2.1.2.1,hlt B.2.1.2,hlgt B.2.1,cl B.2,cl B,MODERATE,N,DOSE INCREASED,N,RECOVERED/RESOLVED,N,N,N,Y,N,N,Y,Y,2021-08-17T00:00:00Z,2021-08-27T00:00:00Z,388,398,2021-07-22T15:18:46.552358Z,3,,,,,,Y,CONCURRENT ILLNESS,PROCEDURE/SURGERY
AB12345,AB12345-BRA-1-id-141,id-141,BRA-1,35,YEARS,F,WHITE,NOT HISPANIC OR LATINO,BRA,N,INV ID BRA-1,Dr. BRA-1 Doe,C: Combination,ARM C,C: Combination,ARM C,C: Combination,C: Combination,C: Combination,C: Combination,South America,B,S1,7.51607612428241,HIGH,Y,Y,Y,Y,N,2020-07-22,2020-07-25T19:10:56.683Z,2023-07-26T12:38:32.683Z,2020-07-25T19:10:56.683Z,2022-07-26T06:49:20.683Z,2022-07-26T06:49:20.683Z,2023-07-26T12:38:32.683Z,2020-07-25T19:10:56.683Z,2022-07-26T06:49:20.683Z,2022-07-26T06:49:20.683Z,2023-07-26T12:38:32.683Z,COMPLETED,COMPLETED,2023-07-26,1096,,,,,,,2023-08-08,,,63113904,2,2,trm D.2.1.5.3,llt D.2.1.5.3,dcd D.2.1.5.3,hlt D.2.1.5,hlgt D.2.1,cl D.2,cl D,MILD,N,DOSE INCREASED,Y,RECOVERED/RESOLVED,N,N,Y,N,N,N,Y,N,2021-10-23T00:00:00Z,2023-07-13T00:00:00Z,455,1083,2021-07-16T11:13:58.189148Z,1,,,,,D.2.1.5.3/A.1.1.1.1 AESI,Y,CONCURRENT ILLNESS,MEDICATION
AB12345,AB12345-BRA-1-id-141,id-141,BRA-1,35,YEARS,F,WHITE,NOT HISPANIC OR LATINO,BRA,N,INV ID BRA-1,Dr. BRA-1 Doe,C: Combination,ARM C,C: Combination,ARM C,C: Combination,C: Combination,C: Combination,C: Combination,South America,B,S1,7.51607612428241,HIGH,Y,Y,Y,Y,N,2020-07-22,2020-07-25T19:10:56.683Z,2023-07-26T12:38:32.683Z,2020-07-25T19:10:56.683Z,2022-07-26T06:49:20.683Z,2022-07-26T06:49:20.683Z,2023-07-26T12:38:32.683Z,2020-07-25T19:10:56.683Z,2022-07-26T06:49:20.683Z,2022-07-26T06:49:20.683Z,2023-07-26T12:38:32.683Z,COMPLETED,COMPLETED,2023-07-26,1096,,,,,,,2023-08-08,,,63113904,3,3,trm A.1.1.1.1,llt A.1.1.1.1,dcd A.1.1.1.1,hlt A.1.1.1,hlgt A.1.1,cl A.1,cl A,MILD,N,DOSE REDUCED,N,RECOVERED/RESOLVED WITH SEQUELAE,N,N,Y,N,N,N,Y,Y,2022-08-03T00:00:00Z,2022-09-07T00:00:00Z,739,774,2022-07-02T15:10:52.335214Z,1,,,,,D.2.1.5.3/A.1.1.1.1 AESI,Y,NONE,SUBJECT DISCONTINUED FROM STUDY
AB12345,AB12345-BRA-1-id-141,id-141,BRA-1,35,YEARS,F,WHITE,NOT HISPANIC OR LATINO,BRA,N,INV ID BRA-1,Dr. BRA-1 Doe,C: Combination,ARM C,C: Combination,ARM C,C: Combination,C: Combination,C: Combination,C: Combination,South America,B,S1,7.51607612428241,HIGH,Y,Y,Y,Y,N,2020-07-22,2020-07-25T19:10:56.683Z,2023-07-26T12:38:32.683Z,2020-07-25T19:10:56.683Z,2022-07-26T06:49:20.683Z,2022-07-26T06:49:20.683Z,2023-07-26T12:38:32.683Z,2020-07-25T19:10:56.683Z,2022-07-26T06:49:20.683Z,2022-07-26T06:49:20.683Z,2023-07-26T12:38:32.683Z,COMPLETED,COMPLETED,2023-07-26,1096,,,,,,,2023-08-08,,,63113904,4,4,trm A.1.1.1.2,llt A.1.1.1.2,dcd A.1.1.1.2,hlt A.1.1.1,hlgt A.1.1,cl A.1,cl A,MODERATE,Y,DOSE NOT CHANGED,N,RECOVERED/RESOLVED WITH SEQUELAE,N,N,Y,N,N,N,Y,Y,2023-01-11T00:00:00Z,2023-05-29T00:00:00Z,900,1038,2022-11-11T00:34:31.247832Z,2,,,,,,Y,OTHER,SUBJECT DISCONTINUED FROM STUDY
AB12345,AB12345-BRA-1-id-141,id-141,BRA-1,35,YEARS,F,WHITE,NOT HISPANIC OR LATINO,BRA,N,INV ID BRA-1,Dr. BRA-1 Doe,C: Combination,ARM C,C: Combination,ARM C,C: Combination,C: Combination,C: Combination,C: Combination,South America,B,S1,7.51607612428241,HIGH,Y,Y,Y,Y,N,2020-07-22,2020-07-25T19:10:56.683Z,2023-07-26T12:38:32.683Z,2020-07-25T19:10:56.683Z,2022-07-26T06:49:20.683Z,2022-07-26T06:49:20.683Z,2023-07-26T12:38:32.683Z,2020-07-25T19:10:56.683Z,2022-07-26T06:49:20.683Z,2022-07-26T06:49:20.683Z,2023-07-26T12:38:32.683Z,COMPLETED,COMPLETED,2023-07-26,1096,,,,,,,2023-08-08,,,63113904,5,5,trm A.1.1.1.1,llt A.1.1.1.1,dcd A.1.1.1.1,hlt A.1.1.1,hlgt A.1.1,cl A.1,cl A,MILD,N,DOSE INCREASED,N,RECOVERING/RESOLVING,N,N,N,N,Y,N,Y,N,2023-03-04T00:00:00Z,2023-05-08T00:00:00Z,952,1017,2022-05-24T23:52:36.869139Z,1,,,,,D.2.1.5.3/A.1.1.1.1 AESI,Y,CONCURRENT ILLNESS,NONE
AB12345,AB12345-BRA-1-id-141,id-141,BRA-1,35,YEARS,F,WHITE,NOT HISPANIC OR LATINO,BRA,N,INV ID BRA-1,Dr. BRA-1 Doe,C: Combination,ARM C,C: Combination,ARM C,C: Combination,C: Combination,C: Combination,C: Combination,South America,B,S1,7.51607612428241,HIGH,Y,Y,Y,Y,N,2020-07-22,2020-07-25T19:10:56.683Z,2023-07-26T12:38:32.683Z,2020-07-25T19:10:56.683Z,2022-07-26T06:49:20.683Z,2022-07-26T06:49:20.683Z,2023-07-26T12:38:32.683Z,2020-07-25T19:10:56.683Z,2022-07-26T06:49:20.683Z,2022-07-26T06:49:20.683Z,2023-07-26T12:38:32.683Z,COMPLETED,COMPLETED,2023-07-26,1096,,,,,,,2023-08-08,,,63113904,6,6,trm D.1.1.1.1,llt D.1.1.1.1,dcd D.1.1.1.1,hlt D.1.1.1,hlgt D.1.1,cl D.1,cl D,SEVERE,Y,NOT EVALUABLE,Y,FATAL,Y,N,N,N,N,N,Y,N,2023-07-24T00:00:00Z,2023-07-26T00:00:00Z,1094,1096,2021-08-02T15:14:36.738363Z,5,,,,,,Y,DISEASE UNDER STUDY,SUBJECT DISCONTINUED FROM STUDY
AB12345,AB12345-BRA-1-id-236,id-236,BRA-1,32,YEARS,M,BLACK OR AFRICAN AMERICAN, NOT REPORTED,BRA,N,INV ID BRA-1,Dr. BRA-1 Doe,B: Placebo,ARM B,B: Placebo,ARM B,B: Placebo,B: Placebo,C: Combination,B: Placebo,South America,A,S2,7.66300121077566,HIGH,Y,Y,Y,Y,N,2021-01-11,2021-01-15T13:37:05.683Z,2024-01-16T07:04:41.683Z,2021-01-15T13:37:05.683Z,2023-01-16T01:15:29.683Z,2023-01-16T01:15:29.683Z,2024-01-16T07:04:41.683Z,2021-01-15T13:37:05.683Z,2023-01-16T01:15:29.683Z,2023-01-16T01:15:29.683Z,2024-01-16T07:04:41.683Z,COMPLETED,COMPLETED,2024-01-16,1096,,,,,,,2024-01-26,,,63113904,1,1,trm B.1.1.1.1,llt B.1.1.1.1,dcd B.1.1.1.1,hlt B.1.1.1,hlgt B.1.1,cl B.1,cl B,SEVERE,Y,NOT EVALUABLE,Y,FATAL,Y,N,N,N,N,N,Y,N,2021-02-17T00:00:00Z,2022-10-24T00:00:00Z,33,647,2021-02-05T18:30:18.008107Z,5,,,,,,Y,CONCURRENT ILLNESS,NONE
AB12345,AB12345-BRA-1-id-236,id-236,BRA-1,32,YEARS,M,BLACK OR AFRICAN AMERICAN, NOT REPORTED,BRA,N,INV ID BRA-1,Dr. BRA-1 Doe,B: Placebo,ARM B,B: Placebo,ARM B,B: Placebo,B: Placebo,C: Combination,B: Placebo,South America,A,S2,7.66300121077566,HIGH,Y,Y,Y,Y,N,2021-01-11,2021-01-15T13:37:05.683Z,2024-01-16T07:04:41.683Z,2021-01-15T13:37:05.683Z,2023-01-16T01:15:29.683Z,2023-01-16T01:15:29.683Z,2024-01-16T07:04:41.683Z,2021-01-15T13:37:05.683Z,2023-01-16T01:15:29.683Z,2023-01-16T01:15:29.683Z,2024-01-16T07:04:41.683Z,COMPLETED,COMPLETED,2024-01-16,1096,,,,,,,2024-01-26,,,63113904,2,2,trm B.1.1.1.1,llt B.1.1.1.1,dcd B.1.1.1.1,hlt B.1.1.1,hlgt B.1.1,cl B.1,cl B,SEVERE,Y,NOT EVALUABLE,Y,FATAL,Y,N,N,N,N,N,Y,Y,2021-10-13T00:00:00Z,2023-11-27T00:00:00Z,271,1046,2021-01-29T05:32:09.495276Z,5,,,,,,Y,DISEASE UNDER STUDY,PROCEDURE/SURGERY
AB12345,AB12345-BRA-1-id-236,id-236,BRA-1,32,YEARS,M,BLACK OR AFRICAN AMERICAN, NOT REPORTED,BRA,N,INV ID BRA-1,Dr. BRA-1 Doe,B: Placebo,ARM B,B: Placebo,ARM B,B: Placebo,B: Placebo,C: Combination,B: Placebo,South America,A,S2,7.66300121077566,HIGH,Y,Y,Y,Y,N,2021-01-11,2021-01-15T13:37:05.683Z,2024-01-16T07:04:41.683Z,2021-01-15T13:37:05.683Z,2023-01-16T01:15:29.683Z,2023-01-16T01:15:29.683Z,2024-01-16T07:04:41.683Z,2021-01-15T13:37:05.683Z,2023-01-16T01:15:29.683Z,2023-01-16T01:15:29.683Z,2024-01-16T07:04:41.683Z,COMPLETED,COMPLETED,2024-01-16,1096,,,,,,,2024-01-26,,,63113904,3,3,trm B.1.1.1.1,llt B.1.1.1.1,dcd B.1.1.1.1,hlt B.1.1.1,hlgt B.1.1,cl B.1,cl B,SEVERE,Y,NOT EVALUABLE,Y,FATAL,Y,N,N,N,N,N,Y,Y,2023-12-03T00:00:00Z,2023-12-09T00:00:00Z,1052,1058,2021-11-06T00:03:35.427449Z,5,,,,,,Y,OTHER,PROCEDURE/SURGERY
AB12345,AB12345-BRA-1-id-265,id-265,BRA-1,25,YEARS,M,WHITE,NOT HISPANIC OR LATINO,BRA,Y,INV ID BRA-1,Dr. BRA-1 Doe,C: Combination,ARM C,C: Combination,ARM C,C: Combination,C: Combination,C: Combination,C: Combination,South America,A,S2,10.323346349886,MEDIUM,Y,Y,Y,N,N,2019-10-03,2019-10-07T20:01:52.683Z,2022-02-16T18:31:21.683Z,2019-10-07T20:01:52.683Z,2021-02-16T12:42:09.683Z,2021-02-16T12:42:09.683Z,2022-02-16T18:31:21.683Z,2019-10-07T20:01:52.683Z,2021-02-16T12:42:09.683Z,2021-02-16T12:42:09.683Z,2022-02-16T18:31:21.683Z,DISCONTINUED,DISCONTINUED,2022-02-16,863,DEATH,2022-02-26,SUICIDE,OTHER,10,<=30,2022-02-26,873,No,63113904,1,1,trm C.2.1.2.1,llt C.2.1.2.1,dcd C.2.1.2.1,hlt C.2.1.2,hlgt C.2.1,cl C.2,cl C,MODERATE,N,DRUG WITHDRAWN,Y,NOT RECOVERED/NOT RESOLVED,N,N,N,N,Y,N,Y,Y,2019-12-30T00:00:00Z,2020-03-17T00:00:00Z,84,162,2019-12-01T14:25:36.920315Z,2,,,,,,Y,OTHER,SUBJECT DISCONTINUED FROM STUDY
AB12345,AB12345-BRA-1-id-265,id-265,BRA-1,25,YEARS,M,WHITE,NOT HISPANIC OR LATINO,BRA,Y,INV ID BRA-1,Dr. BRA-1 Doe,C: Combination,ARM C,C: Combination,ARM C,C: Combination,C: Combination,C: Combination,C: Combination,South America,A,S2,10.323346349886,MEDIUM,Y,Y,Y,N,N,2019-10-03,2019-10-07T20:01:52.683Z,2022-02-16T18:31:21.683Z,2019-10-07T20:01:52.683Z,2021-02-16T12:42:09.683Z,2021-02-16T12:42:09.683Z,2022-02-16T18:31:21.683Z,2019-10-07T20:01:52.683Z,2021-02-16T12:42:09.683Z,2021-02-16T12:42:09.683Z,2022-02-16T18:31:21.683Z,DISCONTINUED,DISCONTINUED,2022-02-16,863,DEATH,2022-02-26,SUICIDE,OTHER,10,<=30,2022-02-26,873,No,63113904,2,2,trm D.1.1.4.2,llt D.1.1.4.2,dcd D.1.1.4.2,hlt D.1.1.4,hlgt D.1.1,cl D.1,cl D,MODERATE,N,UNKNOWN,N,RECOVERED/RESOLVED,N,N,Y,N,N,N,Y,Y,2020-09-20T00:00:00Z,2021-07-01T00:00:00Z,349,633,2020-05-19T00:48:04.600806Z,3,,,,,,Y,CONCURRENT ILLNESS,MEDICATION
AB12345,AB12345-BRA-1-id-265,id-265,BRA-1,25,YEARS,M,WHITE,NOT HISPANIC OR LATINO,BRA,Y,INV ID BRA-1,Dr. BRA-1 Doe,C: Combination,ARM C,C: Combination,ARM C,C: Combination,C: Combination,C: Combination,C: Combination,South America,A,S2,10.323346349886,MEDIUM,Y,Y,Y,N,N,2019-10-03,2019-10-07T20:01:52.683Z,2022-02-16T18:31:21.683Z,2019-10-07T20:01:52.683Z,2021-02-16T12:42:09.683Z,2021-02-16T12:42:09.683Z,2022-02-16T18:31:21.683Z,2019-10-07T20:01:52.683Z,2021-02-16T12:42:09.683Z,2021-02-16T12:42:09.683Z,2022-02-16T18:31:21.683Z,DISCONTINUED,DISCONTINUED,2022-02-16,863,DEATH,2022-02-26,SUICIDE,OTHER,10,<=30,2022-02-26,873,No,63113904,3,3,trm D.1.1.1.1,llt D.1.1.1.1,dcd D.1.1.1.1,hlt D.1.1.1,hlgt D.1.1,cl D.1,cl D,SEVERE,Y,NOT EVALUABLE,Y,FATAL,Y,N,N,N,N,N,Y,N,2021-08-23T00:00:00Z,2021-09-28T00:00:00Z,686,722,2020-01-07T11:34:25.635999Z,5,,,,,,Y,OTHER,PROCEDURE/SURGERY
AB12345,AB12345-BRA-1-id-265,id-265,BRA-1,25,YEARS,M,WHITE,NOT HISPANIC OR LATINO,BRA,Y,INV ID BRA-1,Dr. BRA-1 Doe,C: Combination,ARM C,C: Combination,ARM C,C: Combination,C: Combination,C: Combination,C: Combination,South America,A,S2,10.323346349886,MEDIUM,Y,Y,Y,N,N,2019-10-03,2019-10-07T20:01:52.683Z,2022-02-16T18:31:21.683Z,2019-10-07T20:01:52.683Z,2021-02-16T12:42:09.683Z,2021-02-16T12:42:09.683Z,2022-02-16T18:31:21.683Z,2019-10-07T20:01:52.683Z,2021-02-16T12:42:09.683Z,2021-02-16T12:42:09.683Z,2022-02-16T18:31:21.683Z,DISCONTINUED,DISCONTINUED,2022-02-16,863,DEATH,2022-02-26,SUICIDE,OTHER,10,<=30,2022-02-26,873,No,63113904,4,4,trm C.1.1.1.3,llt C.1.1.1.3,dcd C.1.1.1.3,hlt C.1.1.1,hlgt C.1.1,cl C.1,cl C,SEVERE,N,UNKNOWN,Y,RECOVERED/RESOLVED WITH SEQUELAE,N,Y,N,N,N,N,Y,Y,2021-09-12T00:00:00Z,2021-11-16T00:00:00Z,706,771,2019-11-20T15:23:05.144715Z,4,C.1.1.1.3/B.2.2.3.1 AESI,,BROAD,,,Y,OTHER,MEDICATION
AB12345,AB12345-BRA-1-id-42,id-42,BRA-1,36,YEARS,M,BLACK OR AFRICAN AMERICAN,NOT HISPANIC OR LATINO,BRA,N,INV ID BRA-1,Dr. BRA-1 Doe,A: Drug X,ARM A,A: Drug X,ARM A,A: Drug X,A: Drug X,A: Drug X,A: Drug X,South America,B,S1,2.26753940777848,MEDIUM,Y,Y,Y,Y,Y,2020-01-01,2020-01-02T02:08:39.683Z,,2020-01-02T02:08:39.683Z,,,,2020-01-02T02:08:39.683Z,,,,ONGOING,ONGOING,,,,,,,,,,,,63113904,1,1,trm C.2.1.2.1,llt C.2.1.2.1,dcd C.2.1.2.1,hlt C.2.1.2,hlgt C.2.1,cl C.2,cl C,MODERATE,N,NOT EVALUABLE,Y,NOT RECOVERED/NOT RESOLVED,N,N,N,N,N,Y,Y,N,2020-02-10T00:00:00Z,2021-06-30T00:00:00Z,39,545,2020-01-10T16:35:57.420690Z,2,,,,,,"",OTHER,PROCEDURE/SURGERY
AB12345,AB12345-BRA-1-id-42,id-42,BRA-1,36,YEARS,M,BLACK OR AFRICAN AMERICAN,NOT HISPANIC OR LATINO,BRA,N,INV ID BRA-1,Dr. BRA-1 Doe,A: Drug X,ARM A,A: Drug X,ARM A,A: Drug X,A: Drug X,A: Drug X,A: Drug X,South America,B,S1,2.26753940777848,MEDIUM,Y,Y,Y,Y,Y,2020-01-01,2020-01-02T02:08:39.683Z,,2020-01-02T02:08:39.683Z,,,,2020-01-02T02:08:39.683Z,,,,ONGOING,ONGOING,,,,,,,,,,,,63113904,2,2,trm D.1.1.1.1,llt D.1.1.1.1,dcd D.1.1.1.1,hlt D.1.1.1,hlgt D.1.1,cl D.1,cl D,SEVERE,Y,NOT EVALUABLE,Y,FATAL,Y,N,N,N,N,N,Y,N,2020-03-07T00:00:00Z,2021-11-26T00:00:00Z,65,694,2020-01-08T11:07:31.239972Z,5,,,,,,"",OTHER,MEDICATION
AB12345,AB12345-BRA-1-id-42,id-42,BRA-1,36,YEARS,M,BLACK OR AFRICAN AMERICAN,NOT HISPANIC OR LATINO,BRA,N,INV ID BRA-1,Dr. BRA-1 Doe,A: Drug X,ARM A,A: Drug X,ARM A,A: Drug X,A: Drug X,A: Drug X,A: Drug X,South America,B,S1,2.26753940777848,MEDIUM,Y,Y,Y,Y,Y,2020-01-01,2020-01-02T02:08:39.683Z,,2020-01-02T02:08:39.683Z,,,,2020-01-02T02:08:39.683Z,,,,ONGOING,ONGOING,,,,,,,,,,,,63113904,3,3,trm C.2.1.2.1,llt C.2.1.2.1,dcd C.2.1.2.1,hlt C.2.1.2,hlgt C.2.1,cl C.2,cl C,MODERATE,N,DOSE NOT CHANGED,Y,RECOVERING/RESOLVING,N,N,N,Y,N,N,Y,N,2020-04-06T00:00:00Z,2021-02-06T00:00:00Z,95,401,2020-04-01T11:08:23.021071Z,2,,,,,,"",OTHER,NONE
AB12345,AB12345-BRA-1-id-42,id-42,BRA-1,36,YEARS,M,BLACK OR AFRICAN AMERICAN,NOT HISPANIC OR LATINO,BRA,N,INV ID BRA-1,Dr. BRA-1 Doe,A: Drug X,ARM A,A: Drug X,ARM A,A: Drug X,A: Drug X,A: Drug X,A: Drug X,South America,B,S1,2.26753940777848,MEDIUM,Y,Y,Y,Y,Y,2020-01-01,2020-01-02T02:08:39.683Z,,2020-01-02T02:08:39.683Z,,,,2020-01-02T02:08:39.683Z,,,,ONGOING,ONGOING,,,,,,,,,,,,63113904,4,4,trm A.1.1.1.2,llt A.1.1.1.2,dcd A.1.1.1.2,hlt A.1.1.1,hlgt A.1.1,cl A.1,cl A,MODERATE,Y,DOSE NOT CHANGED,N,NOT RECOVERED/NOT RESOLVED,N,N,Y,N,N,N,Y,Y,2020-06-10T00:00:00Z,2021-02-24T00:00:00Z,160,419,2020-02-16T19:34:29.610680Z,2,,,,,,"",OTHER,SUBJECT DISCONTINUED FROM STUDY
AB12345,AB12345-BRA-1-id-42,id-42,BRA-1,36,YEARS,M,BLACK OR AFRICAN AMERICAN,NOT HISPANIC OR LATINO,BRA,N,INV ID BRA-1,Dr. BRA-1 Doe,A: Drug X,ARM A,A: Drug X,ARM A,A: Drug X,A: Drug X,A: Drug X,A: Drug X,South America,B,S1,2.26753940777848,MEDIUM,Y,Y,Y,Y,Y,2020-01-01,2020-01-02T02:08:39.683Z,,2020-01-02T02:08:39.683Z,,,,2020-01-02T02:08:39.683Z,,,,ONGOING,ONGOING,,,,,,,,,,,,63113904,5,5,trm B.2.2.3.1,llt B.2.2.3.1,dcd B.2.2.3.1,hlt B.2.2.3,hlgt B.2.2,cl B.2,cl B,MILD,Y,DOSE NOT CHANGED,N,RECOVERED/RESOLVED,N,N,Y,N,N,N,Y,N,2020-10-20T00:00:00Z,2020-12-09T00:00:00Z,292,342,2020-04-10T02:21:20.652876Z,1,C.1.1.1.3/B.2.2.3.1 AESI,,BROAD,,,"",OTHER,NONE
AB12345,AB12345-BRA-1-id-42,id-42,BRA-1,36,YEARS,M,BLACK OR AFRICAN AMERICAN,NOT HISPANIC OR LATINO,BRA,N,INV ID BRA-1,Dr. BRA-1 Doe,A: Drug X,ARM A,A: Drug X,ARM A,A: Drug X,A: Drug X,A: Drug X,A: Drug X,South America,B,S1,2.26753940777848,MEDIUM,Y,Y,Y,Y,Y,2020-01-01,2020-01-02T02:08:39.683Z,,2020-01-02T02:08:39.683Z,,,,2020-01-02T02:08:39.683Z,,,,ONGOING,ONGOING,,,,,,,,,,,,63113904,6,6,trm A.1.1.1.2,llt A.1.1.1.2,dcd A.1.1.1.2,hlt A.1.1.1,hlgt A.1.1,cl A.1,cl A,MODERATE,Y,DOSE NOT CHANGED,N,RECOVERING/RESOLVING,N,Y,N,N,N,N,Y,Y,2021-04-06T00:00:00Z,2021-10-17T00:00:00Z,460,654,2021-03-27T18:29:27.707127Z,2,,,,,,"",CONCURRENT ILLNESS,PROCEDURE/SURGERY
AB12345,AB12345-BRA-1-id-42,id-42,BRA-1,36,YEARS,M,BLACK OR AFRICAN AMERICAN,NOT HISPANIC OR LATINO,BRA,N,INV ID BRA-1,Dr. BRA-1 Doe,A: Drug X,ARM A,A: Drug X,ARM A,A: Drug X,A: Drug X,A: Drug X,A: Drug X,South America,B,S1,2.26753940777848,MEDIUM,Y,Y,Y,Y,Y,2020-01-01,2020-01-02T02:08:39.683Z,,2020-01-02T02:08:39.683Z,,,,2020-01-02T02:08:39.683Z,,,,ONGOING,ONGOING,,,,,,,,,,,,63113904,7,7,trm B.1.1.1.1,llt B.1.1.1.1,dcd B.1.1.1.1,hlt B.1.1.1,hlgt B.1.1,cl B.1,cl B,SEVERE,Y,NOT EVALUABLE,Y,FATAL,Y,N,N,N,N,N,Y,N,2021-04-16T00:00:00Z,2021-08-24T00:00:00Z,470,600,2021-01-09T19:26:33.568439Z,5,,,,,,"",OTHER,SUBJECT DISCONTINUED FROM STUDY
AB12345,AB12345-BRA-1-id-42,id-42,BRA-1,36,YEARS,M,BLACK OR AFRICAN AMERICAN,NOT HISPANIC OR LATINO,BRA,N,INV ID BRA-1,Dr. BRA-1 Doe,A: Drug X,ARM A,A: Drug X,ARM A,A: Drug X,A: Drug X,A: Drug X,A: Drug X,South America,B,S1,2.26753940777848,MEDIUM,Y,Y,Y,Y,Y,2020-01-01,2020-01-02T02:08:39.683Z,,2020-01-02T02:08:39.683Z,,,,2020-01-02T02:08:39.683Z,,,,ONGOING,ONGOING,,,,,,,,,,,,63113904,8,8,trm A.1.1.1.2,llt A.1.1.1.2,dcd A.1.1.1.2,hlt A.1.1.1,hlgt A.1.1,cl A.1,cl A,MODERATE,Y,DOSE NOT CHANGED,N,RECOVERED/RESOLVED WITH SEQUELAE,N,N,Y,N,N,N,Y,Y,2021-04-22T00:00:00Z,2021-08-12T00:00:00Z,476,588,2020-01-31T11:13:50.033025Z,2,,,,,,"",NONE,PROCEDURE/SURGERY
AB12345,AB12345-BRA-1-id-42,id-42,BRA-1,36,YEARS,M,BLACK OR AFRICAN AMERICAN,NOT HISPANIC OR LATINO,BRA,N,INV ID BRA-1,Dr. BRA-1 Doe,A: Drug X,ARM A,A: Drug X,ARM A,A: Drug X,A: Drug X,A: Drug X,A: Drug X,South America,B,S1,2.26753940777848,MEDIUM,Y,Y,Y,Y,Y,2020-01-01,2020-01-02T02:08:39.683Z,,2020-01-02T02:08:39.683Z,,,,2020-01-02T02:08:39.683Z,,,,ONGOING,ONGOING,,,,,,,,,,,,63113904,9,9,trm C.1.1.1.3,llt C.1.1.1.3,dcd C.1.1.1.3,hlt C.1.1.1,hlgt C.1.1,cl C.1,cl C,SEVERE,N,DOSE NOT CHANGED,Y,RECOVERING/RESOLVING,N,Y,N,N,N,N,Y,Y,2021-05-13T00:00:00Z,2021-10-21T00:00:00Z,497,658,2020-12-07T11:38:35.982046Z,4,C.1.1.1.3/B.2.2.3.1 AESI,,BROAD,,,"",OTHER,NONE
AB12345,AB12345-BRA-1-id-42,id-42,BRA-1,36,YEARS,M,BLACK OR AFRICAN AMERICAN,NOT HISPANIC OR LATINO,BRA,N,INV ID BRA-1,Dr. BRA-1 Doe,A: Drug X,ARM A,A: Drug X,ARM A,A: Drug X,A: Drug X,A: Drug X,A: Drug X,South America,B,S1,2.26753940777848,MEDIUM,Y,Y,Y,Y,Y,2020-01-01,2020-01-02T02:08:39.683Z,,2020-01-02T02:08:39.683Z,,,,2020-01-02T02:08:39.683Z,,,,ONGOING,ONGOING,,,,,,,,,,,,63113904,10,10,trm B.1.1.1.1,llt B.1.1.1.1,dcd B.1.1.1.1,hlt B.1.1.1,hlgt B.1.1,cl B.1,cl B,SEVERE,Y,NOT EVALUABLE,Y,FATAL,Y,N,N,N,N,N,Y,Y,2021-10-05T00:00:00Z,2021-10-19T00:00:00Z,642,656,2021-09-26T06:38:16.993624Z,5,,,,,,"",NONE,MEDICATION
AB12345,AB12345-BRA-1-id-65,id-65,BRA-1,25,YEARS,F,BLACK OR AFRICAN AMERICAN,NOT HISPANIC OR LATINO,BRA,N,INV ID BRA-1,Dr. BRA-1 Doe,B: Placebo,ARM B,B: Placebo,ARM B,B: Placebo,B: Placebo,A: Drug X,C: Combination,South America,A,S2,7.34091885189189,MEDIUM,Y,Y,Y,Y,N,2019-07-15,2019-07-15T17:56:41.683Z,2022-07-15T11:24:17.683Z,2019-07-15T17:56:41.683Z,2021-07-15T05:35:05.683Z,2021-07-15T05:35:05.683Z,2022-07-15T11:24:17.683Z,2019-07-15T17:56:41.683Z,2021-07-15T05:35:05.683Z,2021-07-15T05:35:05.683Z,2022-07-15T11:24:17.683Z,COMPLETED,COMPLETED,2022-07-15,1096,,,,,,,2022-08-11,,,63113904,1,1,trm C.2.1.2.1,llt C.2.1.2.1,dcd C.2.1.2.1,hlt C.2.1.2,hlgt C.2.1,cl C.2,cl C,MODERATE,N,DOSE NOT CHANGED,Y,NOT RECOVERED/NOT RESOLVED,N,N,N,Y,N,N,Y,Y,2020-02-17T00:00:00Z,2021-02-10T00:00:00Z,217,576,2019-08-24T13:26:02.122490Z,2,,,,,,Y,OTHER,PROCEDURE/SURGERY
AB12345,AB12345-BRA-1-id-65,id-65,BRA-1,25,YEARS,F,BLACK OR AFRICAN AMERICAN,NOT HISPANIC OR LATINO,BRA,N,INV ID BRA-1,Dr. BRA-1 Doe,B: Placebo,ARM B,B: Placebo,ARM B,B: Placebo,B: Placebo,A: Drug X,C: Combination,South America,A,S2,7.34091885189189,MEDIUM,Y,Y,Y,Y,N,2019-07-15,2019-07-15T17:56:41.683Z,2022-07-15T11:24:17.683Z,2019-07-15T17:56:41.683Z,2021-07-15T05:35:05.683Z,2021-07-15T05:35:05.683Z,2022-07-15T11:24:17.683Z,2019-07-15T17:56:41.683Z,2021-07-15T05:35:05.683Z,2021-07-15T05:35:05.683Z,2022-07-15T11:24:17.683Z,COMPLETED,COMPLETED,2022-07-15,1096,,,,,,,2022-08-11,,,63113904,2,2,trm D.2.1.5.3,llt D.2.1.5.3,dcd D.2.1.5.3,hlt D.2.1.5,hlgt D.2.1,cl D.2,cl D,MILD,N,DOSE NOT CHANGED,Y,RECOVERED/RESOLVED,N,N,Y,N,N,N,Y,Y,2020-04-26T00:00:00Z,2020-10-16T00:00:00Z,286,459,2020-03-18T07:29:32.577417Z,1,,,,,D.2.1.5.3/A.1.1.1.1 AESI,Y,OTHER,PROCEDURE/SURGERY